Reaction Details
TargetNociceptin receptor
LigandBDBM50159914
Substrate/Competitorn/a
Meas. Tech.ChEMBL_303722 (CHEMBL829057)
Ki 39±n/a nM
Citation Palin, RBarn, DRClark, JKCottney, JECowley, PMCrockatt, MEvans, LFeilden, HGoodwin, RRGriekspoor, FGrove, SJHoughton, AKJones, PSMorphy, RJSmith, ARSundaram, HVrolijk, DWeston, MAWishart, GWren, P Synthesis and SAR studies of 3-phenoxypropyl piperidine analogues as ORL1 (NOP) receptor agonists. Bioorg Med Chem Lett15:589-93 (2005) 
 
Nociceptin receptor
Name:Nociceptin receptor
Type:G Protein-Coupled Receptor (GPCR)
Mol. Mass.:40702.87
Organism:Homo sapiens (Human)
Description:P41146
Residue:370
BDBM50159914
NameBDBM50159914
Synonyms:1-{1-[4-Methyl-3-(5-methyl-2-nitro-phenoxy)-pentyl]-piperidin-4-yl}-1,3-dihydro-benzoimidazol-2-one | CHEMBL182202
TypeSmall organic molecule
Emp. Form.C25H32N4O4
Mol. Mass.452.546
SMILESCC(C)C(CCN1CCC(CC1)n1c2ccccc2[n-]c1=[OH+])Oc1cc(C)ccc1[N+]([O-])=O