Reaction Details
TargetNociceptin receptor
LigandBDBM50159909
Substrate/Competitorn/a
Meas. Tech.ChEMBL_313039 (CHEMBL835730)
IC50 1081±n/a nM
Citation Palin, RBarn, DRClark, JKCottney, JECowley, PMCrockatt, MEvans, LFeilden, HGoodwin, RRGriekspoor, FGrove, SJHoughton, AKJones, PSMorphy, RJSmith, ARSundaram, HVrolijk, DWeston, MAWishart, GWren, P Synthesis and SAR studies of 3-phenoxypropyl piperidine analogues as ORL1 (NOP) receptor agonists. Bioorg Med Chem Lett15:589-93 (2005) 
 
Nociceptin receptor
Name:Nociceptin receptor
Type:G Protein-Coupled Receptor (GPCR)
Mol. Mass.:40702.87
Organism:Homo sapiens (Human)
Description:P41146
Residue:370
BDBM50159909
NameBDBM50159909
Synonyms:1-{1-[3-(2-Chloro-5-methyl-phenoxy)-2-hydroxy-5-methyl-hexyl]-piperidin-4-yl}-1,3-dihydro-benzoimidazol-2-one | CHEMBL178318
TypeSmall organic molecule
Emp. Form.C26H34ClN3O3
Mol. Mass.472.019
SMILESCC(C)CC(Oc1cc(C)ccc1Cl)C(O)CN1CCC(CC1)n1c2ccccc2[nH]c1=O