Reaction Details
TargetFibroblast growth factor receptor 2
LigandBDBM50588768
Substrate/Competitorn/a
Meas. Tech.ChEMBL_2188263 (CHEMBL5100345)
IC50 0.200000±n/a nM
Citation Shvartsbart, ARoach, JJWitten, MRKoblish, HHarris, JJCovington, MHess, RLin, LFrascella, MTruong, LLeffet, LConlen, PBeshad, EKlabe, RKatiyar, KKaldon, LYoung-Sciame, RHe, XPetusky, SChen, KJHorsey, ALei, HTEpling, LBDeller, MCVechorkin, OYao, W Discovery of Potent and Selective Inhibitors of Wild-Type and Gatekeeper Mutant Fibroblast Growth Factor Receptor (FGFR) 2/3. J Med Chem65:15433-15442 (2022) 
 
Fibroblast growth factor receptor 2
Name:Fibroblast growth factor receptor 2
Type:Enzyme
Mol. Mass.:92015.45
Organism:Homo sapiens (Human)
Description:P21802
Residue:821
BDBM50588768
NameBDBM50588768
Synonyms:CHEMBL5175256
TypeSmall organic molecule
Emp. Form.C23H26N8O2
Mol. Mass.449.5234
SMILES[2H]C([2H])([2H])NC(=O)c1cncc(c1)-c1cnn2cc(-c3ccn(n3)C(C)C)c(N[C@H]3CCOC3)nc12