Reaction Details
TargetAlpha-1A adrenergic receptor
LigandBDBM50060965
Substrate/Competitorn/a
Meas. Tech.ChEMBL_303296 (CHEMBL827429)
Ki 0.22±n/a nM
Citation Li, MYTsai, KCXia, L Pharmacophore identification of alpha(1A)-adrenoceptor antagonists. Bioorg Med Chem Lett15:657-64 (2005) 
 
Alpha-1A adrenergic receptor
Name:Alpha-1A adrenergic receptor
Type:Cell-surface receptors
Mol. Mass.:51511.67
Organism:Homo sapiens (Human)
Description:P35348
Residue:466
BDBM50060965
NameBDBM50060965
Synonyms:2-[2-((3aR,9bR)-6-Methoxy-1,3,3a,4,5,9b-hexahydro-benzo[e]isoindol-2-yl)-ethyl]-4H-9-thia-2,4,5-triaza-fluorene-1,3-dione 2-[2-(6-Methoxy-1,3,3a,4,5,9b-hexahydro-benzo[e]isoindol-2-yl)-ethyl]-4H-9-thia-2,4,5-triaza-fluorene-1,3-dione CHEMBL40650
TypeSmall organic molecule
Emp. Form.C24H24N4O3S
Mol. Mass.448.537
SMILESCOc1cccc2[C@@H]3CN(CCn4c(=O)[nH]c5c6ncccc6sc5c4=O)C[C@@H]3CCc12