Reaction Details
TargetEstrogen receptor beta
LigandBDBM50160297
Substrate/Competitorn/a
Meas. Tech.ChEMBL_304915 (CHEMBL827808)
IC50 2.1±n/a nM
Citation Liu, JBirzin, ETChan, WYang, YTPai, LYDasilva, CHayes, ECMosley, RTDininno, FRohrer, SPSchaeffer, JMHammond, ML Estrogen receptor ligands. Part 11: Synthesis and activity of isochromans and isothiochromans. Bioorg Med Chem Lett15:715-8 (2005) 
 
Estrogen receptor beta
Name:Estrogen receptor beta
Type:Protein
Mol. Mass.:59238.43
Organism:Homo sapiens (Human)
Description:Q92731
Residue:530
BDBM50160297
NameBDBM50160297
Synonyms:(3S,4R)-3-Phenyl-4-[4-(2-pyrrolidin-1-yl-ethoxy)-phenyl]-isothiochroman-7-ol | CHEMBL183333
TypeSmall organic molecule
Emp. Form.C27H29NO2S
Mol. Mass.431.59
SMILESOc1ccc2[C@H]([C@H](SCc2c1)c1ccccc1)c1ccc(OCCN2CCCC2)cc1