Reaction Details
TargetEstrogen receptor
LigandBDBM50144849
Substrate/Competitorn/a
Meas. Tech.ChEMBL_304942 (CHEMBL826971)
IC50 0.8±n/a nM
Citation Liu, JBirzin, ETChan, WYang, YTPai, LYDasilva, CHayes, ECMosley, RTDininno, FRohrer, SPSchaeffer, JMHammond, ML Estrogen receptor ligands. Part 11: Synthesis and activity of isochromans and isothiochromans. Bioorg Med Chem Lett15:715-8 (2005) 
 
Estrogen receptor
Name:Estrogen receptor
Type:Protein
Mol. Mass.:66230.44
Organism:Homo sapiens (Human)
Description:P03372
Residue:595
BDBM50144849
NameBDBM50144849
Synonyms:(2S,3R)-2-(4-(2-(PIPERIDIN-1-YL)ETHOXY)PHENYL)-2,3-DIHYDRO-3-(4-HYDROXYPHENYL)BENZO[B][1,4]OXATHIIN-6-OL CHEMBL304552
TypeSmall organic molecule
Emp. Form.C27H29NO4S
Mol. Mass.463.588
SMILESOc1ccc(cc1)[C@H]1Sc2cc(O)ccc2O[C@H]1c1ccc(OCCN2CCCCC2)cc1