Reaction Details
TargetInosine-5'-monophosphate dehydrogenase 2
LigandBDBM50160378
Substrate/Competitorn/a
Meas. Tech.ChEMBL_305708 (CHEMBL827223)
IC50 22±n/a nM
Citation Buckley, GMDavies, NDyke, HJGilbert, PJHannah, DRHaughan, AFHunt, CAPitt, WRProfit, RHRay, NCRichard, MDSharpe, ATaylor, AJWhitworth, JMWilliams, SC Quinazolinethiones and quinazolinediones, novel inhibitors of inosine monophosphate dehydrogenase: synthesis and initial structure-activity relationships. Bioorg Med Chem Lett15:751-4 (2005) 
 
Inosine-5'-monophosphate dehydrogenase 2
Name:Inosine-5'-monophosphate dehydrogenase 2
Type:Enzyme
Mol. Mass.:55806.87
Organism:Homo sapiens (Human)
Description:Recombinant IMPDH2 expressed in E. coli.
Residue:514
BDBM50160378
NameBDBM50160378
Synonyms:3-(3-Imidazol-1-yl-propyl)-7-methoxy-6-oxazol-5-yl-2-thioxo-2,3-dihydro-1H-quinazolin-4-one | CHEMBL182242
TypeSmall organic molecule
Emp. Form.C18H17N5O3S
Mol. Mass.383.424
SMILESCOc1cc2[nH]c(=S)n(CCCn3ccnc3)c(=O)c2cc1-c1cnco1