Reaction Details
TargetP2Y purinoceptor 12
LigandBDBM50589232
Substrate/Competitorn/a
Meas. Tech.ChEMBL_2193044 (CHEMBL5105404)
Kd 6.5±n/a nM
Citation Ma, BBMontgomery, APChen, BKassiou, MDanon, JJ Strategies for targeting the P2Y Bioorg Med Chem Lett71:0 (2022) 
 
P2Y purinoceptor 12
Name:P2Y purinoceptor 12
Type:Enzyme
Mol. Mass.:39458.48
Organism:Homo sapiens (Human)
Description:Q9H244
Residue:342
BDBM50589232
NameBDBM50589232
Synonyms:CHEMBL5199350
TypeSmall organic molecule
Emp. Form.C13H21N5O10P2S
Mol. Mass.509.378
SMILES[3H]C([3H])C([3H])([3H])CSc1nc(N)c2ncn([C@@H]3O[C@H](COP(O)(=O)OP(O)(O)=O)[C@@H](O)[C@H]3O)c2n1