Reaction Details
TargetCollagenase 3
LigandBDBM50160849
Substrate/Competitorn/a
Meas. Tech.ChEMBL_302508 (CHEMBL828223)
Ki 4.2±n/a nM
Citation Kim, SHPudzianowski, ATLeavitt, KJBarbosa, JMcDonnell, PAMetzler, WJRankin, BMLiu, RVaccaro, WPitts, W Structure-based design of potent and selective inhibitors of collagenase-3 (MMP-13). Bioorg Med Chem Lett15:1101-6 (2005) 
 
Collagenase 3
Name:Collagenase 3
Type:Enzyme
Mol. Mass.:53808.06
Organism:Homo sapiens (Human)
Description:P45452
Residue:471
BDBM50160849
NameBDBM50160849
Synonyms:4-[4-(2,6,8,10-Tetraoxo-1,7,9-triaza-spiro[4.5]dec-1-yl)-phenoxy]-benzoic acid methyl ester | CHEMBL359716
TypeSmall organic molecule
Emp. Form.C21H17N3O7
Mol. Mass.423.3756
SMILESCOC(=O)c1ccc(Oc2ccc(cc2)N2C(=O)CCC22C(=O)NC(=O)NC2=O)cc1