Reaction Details
Target72 kDa type IV collagenase
LigandBDBM50160851
Substrate/Competitorn/a
Meas. Tech.ChEMBL_302479 (CHEMBL827170)
Ki 0.230000±n/a nM
Citation Kim, SHPudzianowski, ATLeavitt, KJBarbosa, JMcDonnell, PAMetzler, WJRankin, BMLiu, RVaccaro, WPitts, W Structure-based design of potent and selective inhibitors of collagenase-3 (MMP-13). Bioorg Med Chem Lett15:1101-6 (2005) 
 
72 kDa type IV collagenase
Name:72 kDa type IV collagenase
Type:Enzyme
Mol. Mass.:73870.36
Organism:Homo sapiens (Human)
Description: P08253
Residue:660
BDBM50160851
NameBDBM50160851
Synonyms:4-[4-(2,6,8,10-Tetraoxo-1,7,9-triaza-spiro[4.5]dec-1-yl)-phenoxy]-benzoic acid | CHEMBL180275
TypeSmall organic molecule
Emp. Form.C20H15N3O7
Mol. Mass.409.349
SMILESOC(=O)c1ccc(Oc2ccc(cc2)N2C(=O)CCC22C(=O)NC(=O)NC2=O)cc1