Reaction Details
Target72 kDa type IV collagenase
LigandBDBM50160847
Substrate/Competitorn/a
Meas. Tech.ChEMBL_302479 (CHEMBL827170)
Ki 1.6±n/a nM
Citation Kim, SHPudzianowski, ATLeavitt, KJBarbosa, JMcDonnell, PAMetzler, WJRankin, BMLiu, RVaccaro, WPitts, W Structure-based design of potent and selective inhibitors of collagenase-3 (MMP-13). Bioorg Med Chem Lett15:1101-6 (2005) 
 
72 kDa type IV collagenase
Name:72 kDa type IV collagenase
Type:Enzyme
Mol. Mass.:73870.36
Organism:Homo sapiens (Human)
Description: P08253
Residue:660
BDBM50160847
NameBDBM50160847
Synonyms:1-(4-phenoxy-phenyl)-1,7,9-triaza-spiro[4.5]decane-2,6,8,10-tetraone | CHEMBL178509
TypeSmall organic molecule
Emp. Form.C19H15N3O5
Mol. Mass.365.3395
SMILESO=C1CCC2(N1c1ccc(Oc3ccccc3)cc1)C(=O)NC(=O)NC2=O