Reaction Details
TargetReverse transcriptase/RNaseH
LigandBDBM50160865
Substrate/Competitorn/a
Meas. Tech.ChEMBL_305018 (CHEMBL829452)
IC50 29±n/a nM
Citation Mashino, TShimotohno, KIkegami, NNishikawa, DOkuda, KTakahashi, KNakamura, SMochizuki, M Human immunodeficiency virus-reverse transcriptase inhibition and hepatitis C virus RNA-dependent RNA polymerase inhibition activities of fullerene derivatives. Bioorg Med Chem Lett15:1107-9 (2005) 
 
Reverse transcriptase/RNaseH
Name:Reverse transcriptase/RNaseH
Type:PROTEIN
Mol. Mass.:65229.15
Organism:Human immunodeficiency virus 1
Description:ChEMBL_1473730
Residue:566
BDBM50160865
NameBDBM50160865
Synonyms:CHEMBL2373969 | Fullerene Derivative
TypeSmall organic molecule
Emp. Form.C68H18O5
Mol. Mass.914.8675
SMILES[H][C@@]12C3=c4c5c6c7c8C(=C9c%10c1c1c%11c%12-c%13c%14c%15c%16c%17c%18c(c4c4c%19c%18c%18c%16c%16c%15c%15c%13[C@]%13([H])c%20c%21c%22c(c8[C@@]%218[C@@H]([C@@H](CC(O)=C)[C@@H](C(O)=O)[C@]98[C@]%13([H])c%10%12)C(O)=O)c8c7c(c7c8c8c%22c(c%15%20)c%16c8c%18c%197)c54)[C@@]([H])([C@@]31[H])[C@@]%17([H])[C@@]%11%14[H])[C@@]26[H]