Reaction Details
TargetRNA-directed RNA polymerase
LigandBDBM50160863
Substrate/Competitorn/a
Meas. Tech.ChEMBL_305682 (CHEMBL828054)
IC50 100±n/a nM
Citation Mashino, TShimotohno, KIkegami, NNishikawa, DOkuda, KTakahashi, KNakamura, SMochizuki, M Human immunodeficiency virus-reverse transcriptase inhibition and hepatitis C virus RNA-dependent RNA polymerase inhibition activities of fullerene derivatives. Bioorg Med Chem Lett15:1107-9 (2005) 
 
RNA-directed RNA polymerase
Name:RNA-directed RNA polymerase
Type:Protein
Mol. Mass.:25173.95
Organism:Hepatitis C virus
Description:Q8JXU8
Residue:229
BDBM50160863
NameBDBM50160863
Synonyms:1-Butyl-3-(1,1-dioxo-1,4-dihydro-1lambda*6*-benzo[1,2,4]thiadiazin-3-yl)-4-hydroxy-1H-quinolin-2-one CHEMBL180974
TypeSmall organic molecule
Emp. Form.C20H19N3O4S
Mol. Mass.397.448
SMILESCCCCn1c2ccccc2c(O)c(C2=NS(=O)(=O)c3ccccc3N2)c1=O