Reaction Details
TargetCaspase-8
LigandBDBM50160951
Substrate/Competitorn/a
Meas. Tech.ChEMBL_305653 (CHEMBL829511)
IC50 6±n/a nM
Citation Han, YGiroux, AColucci, JBayly, CIMckay, DJRoy, SXanthoudakis, SVaillancourt, JRasper, DMTam, JTawa, PNicholson, DWZamboni, RJ Novel pyrazinone mono-amides as potent and reversible caspase-3 inhibitors. Bioorg Med Chem Lett15:1173-80 (2005) 
 
Caspase-8
Name:Caspase-8
Type:Enzyme
Mol. Mass.:55373.89
Organism:Homo sapiens (Human)
Description:Q14790
Residue:479
BDBM50160951
NameBDBM50160951
Synonyms:(S)-5-[(4-Benzyl-piperidin-1-ylmethyl)-amino]-3-(2-{3-[(4-methyl-furazan-3-ylmethyl)-amino]-2-oxo-2H-pyrazin-1-yl}-butyrylamino)-4-oxo-pentanoic acid | CHEMBL441118
TypeSmall organic molecule
Emp. Form.C30H40N8O6
Mol. Mass.608.6886
SMILESCCC(C(=O)N[C@@H](CC(O)=O)C(=O)CNCN1CCC(Cc2ccccc2)CC1)n1ccnc(NCc2nonc2C)c1=O