Reaction Details
TargetCaspase-7
LigandBDBM50160989
Substrate/Competitorn/a
Meas. Tech.ChEMBL_305652 (CHEMBL829510)
IC50 0.042000±n/a nM
Citation Han, YGiroux, AColucci, JBayly, CIMckay, DJRoy, SXanthoudakis, SVaillancourt, JRasper, DMTam, JTawa, PNicholson, DWZamboni, RJ Novel pyrazinone mono-amides as potent and reversible caspase-3 inhibitors. Bioorg Med Chem Lett15:1173-80 (2005) 
 
Caspase-7
Name:Caspase-7
Type:Enzyme
Mol. Mass.:34273.91
Organism:Homo sapiens (Human)
Description:P55210
Residue:303
BDBM50160989
NameBDBM50160989
Synonyms:(S)-3-(2-{5-tert-Butyl-3-[(4-methyl-furazan-3-ylmethyl)-amino]-2-oxo-2H-pyrazin-1-yl}-butyrylamino)-5-{[(hexyl-methyl-amino)-methyl]-amino}-4-oxo-pentanoic acid | CHEMBL361825
TypeSmall organic molecule
Emp. Form.C29H48N8O6
Mol. Mass.604.7414
SMILESCCCCCCN(C)CNCC(=O)[C@H](CC(O)=O)NC(=O)C(CC)n1cc(nc(NCc2nonc2C)c1=O)C(C)(C)C