Reaction Details
TargetCaspase-1
LigandBDBM50160950
Substrate/Competitorn/a
Meas. Tech.ChEMBL_305650 (CHEMBL829508)
IC50 0.028000±n/a nM
Citation Han, YGiroux, AColucci, JBayly, CIMckay, DJRoy, SXanthoudakis, SVaillancourt, JRasper, DMTam, JTawa, PNicholson, DWZamboni, RJ Novel pyrazinone mono-amides as potent and reversible caspase-3 inhibitors. Bioorg Med Chem Lett15:1173-80 (2005) 
 
Caspase-1
Name:Caspase-1
Type:Enzyme
Mol. Mass.:45154.13
Organism:Homo sapiens (Human)
Description:P29466
Residue:404
BDBM50160950
NameBDBM50160950
Synonyms:(S)-5-{[(Hexyl-methyl-amino)-methyl]-amino}-3-(2-{3-[(4-methyl-furazan-3-ylmethyl)-amino]-2-oxo-2H-pyrazin-1-yl}-butyrylamino)-4-oxo-pentanoic acid | CHEMBL359598
TypeSmall organic molecule
Emp. Form.C25H40N8O6
Mol. Mass.548.6351
SMILESCCCCCCN(C)CNCC(=O)[C@H](CC(O)=O)NC(=O)C(CC)n1ccnc(NCc2nonc2C)c1=O