Reaction Details
TargetMetabotropic glutamate receptor 5
LigandBDBM50161013
Substrate/Competitorn/a
Meas. Tech.ChEMBL_306874 (CHEMBL828680)
IC50 11±n/a nM
Citation Bonnefous, CVernier, JMHutchinson, JHChung, JReyes-Manalo, GKamenecka, T Dipyridyl amides: potent metabotropic glutamate subtype 5 (mGlu5) receptor antagonists. Bioorg Med Chem Lett15:1197-200 (2005) 
 
Metabotropic glutamate receptor 5
Name:Metabotropic glutamate receptor 5
Type:Enzyme
Mol. Mass.:132484.72
Organism:Homo sapiens (Human)
Description:n/a
Residue:1212
BDBM50161013
NameBDBM50161013
Synonyms:3-Amino-6-chloro-pyrazine-2-carboxylic acid pyridin-2-ylamide | CHEMBL361556
TypeSmall organic molecule
Emp. Form.C10H8ClN5O
Mol. Mass.249.656
SMILESNc1ncc(Cl)nc1C(=O)Nc1ccccn1