Reaction Details
TargetMetabotropic glutamate receptor 5
LigandBDBM50161033
Substrate/Competitorn/a
Meas. Tech.ChEMBL_306874 (CHEMBL828680)
IC50 5±n/a nM
Citation Bonnefous, CVernier, JMHutchinson, JHChung, JReyes-Manalo, GKamenecka, T Dipyridyl amides: potent metabotropic glutamate subtype 5 (mGlu5) receptor antagonists. Bioorg Med Chem Lett15:1197-200 (2005) 
 
Metabotropic glutamate receptor 5
Name:Metabotropic glutamate receptor 5
Type:Enzyme
Mol. Mass.:132484.72
Organism:Homo sapiens (Human)
Description:n/a
Residue:1212
BDBM50161033
NameBDBM50161033
Synonyms:3-Amino-6-chloro-pyrazine-2-carboxylic acid (6-methyl-pyridin-2-yl)-amide | CHEMBL361973
TypeSmall organic molecule
Emp. Form.C11H10ClN5O
Mol. Mass.263.683
SMILESCc1cccc(NC(=O)c2nc(Cl)cnc2N)n1