Reaction Details
TargetD(3) dopamine receptor
LigandBDBM50119377
Substrate/Competitorn/a
Meas. Tech.ChEMBL_302444 (CHEMBL827141)
Ki 1.1±n/a nM
Citation Boeckler, FLanig, HGmeiner, P Modeling the similarity and divergence of dopamine D2-like receptors and identification of validated ligand-receptor complexes. J Med Chem48:694-709 (2005) 
 
D(3) dopamine receptor
Name:D(3) dopamine receptor
Type:n/a
Mol. Mass.:44243.43
Organism:Homo sapiens (Human)
Description:n/a
Residue:400
BDBM50119377
NameBDBM50119377
Synonyms:Benzofuran-2-carboxylic acid {4-[4-(2-methoxy-phenyl)-piperazin-1-yl]-butyl}-amide N-(4-(4-(2-methoxyphenyl)piperazin-1-yl)butyl)benzofuran-2-carboxamide
TypeSmall organic molecule
Emp. Form.C24H29N3O3
Mol. Mass.407.5054
SMILESCOc1ccccc1N1CCN(CCCCNC(=O)c2cc3ccccc3o2)CC1