Reaction Details
TargetD(4) dopamine receptor
LigandBDBM50119392
Substrate/Competitorn/a
Meas. Tech.ChEMBL_302368 (CHEMBL829549)
Ki 0.67±n/a nM
Citation Boeckler, FLanig, HGmeiner, P Modeling the similarity and divergence of dopamine D2-like receptors and identification of validated ligand-receptor complexes. J Med Chem48:694-709 (2005) 
 
D(4) dopamine receptor
Name:D(4) dopamine receptor
Type:Enzyme
Mol. Mass.:48373.19
Organism:Homo sapiens (Human)
Description:P21917
Residue:419
BDBM50119392
NameBDBM50119392
Synonyms:CHEMBL141845 Pyrazolo[1,5-a]pyridine-3-carboxylic acid {2-[4-(2-methoxy-phenyl)-piperazin-1-yl]-ethyl}-amide
TypeSmall organic molecule
Emp. Form.C21H25N5O2
Mol. Mass.379.4555
SMILESCOc1ccccc1N1CCN(CCNC(=O)c2cnn3ccccc23)CC1