Reaction Details
TargetD(3) dopamine receptor
LigandBDBM50161217
Substrate/Competitorn/a
Meas. Tech.ChEMBL_302737 (CHEMBL838684)
Ki 0.4±n/a nM
Citation Grundt, PCarlson, EECao, JBennett, CJMcElveen, ETaylor, MLuedtke, RRNewman, AH Novel heterocyclic trans olefin analogues of N-{4-[4-(2,3-dichlorophenyl)piperazin-1-yl]butyl}arylcarboxamides as selective probes with high affinity for the dopamine D3 receptor. J Med Chem48:839-48 (2005) 
 
D(3) dopamine receptor
Name:D(3) dopamine receptor
Type:n/a
Mol. Mass.:44243.43
Organism:Homo sapiens (Human)
Description:n/a
Residue:400
BDBM50161217
NameBDBM50161217
Synonyms:CHEMBL195057 | N-{4-[4-(2,3-Dichloro-phenyl)-piperazin-1-yl]-but-2-enyl}-4-hydroxy-benzamide
TypeSmall organic molecule
Emp. Form.C21H23Cl2N3O2
Mol. Mass.420.332
SMILESOc1ccc(cc1)C(=O)NC\C=C\CN1CCN(CC1)c1cccc(Cl)c1Cl