Reaction Details
TargetD(3) dopamine receptor
LigandBDBM50129426
Substrate/Competitorn/a
Meas. Tech.ChEMBL_302843 (CHEMBL827888)
Ki 0.5±n/a nM
Citation Grundt, PCarlson, EECao, JBennett, CJMcElveen, ETaylor, MLuedtke, RRNewman, AH Novel heterocyclic trans olefin analogues of N-{4-[4-(2,3-dichlorophenyl)piperazin-1-yl]butyl}arylcarboxamides as selective probes with high affinity for the dopamine D3 receptor. J Med Chem48:839-48 (2005) 
 
D(3) dopamine receptor
Name:D(3) dopamine receptor
Type:n/a
Mol. Mass.:44243.43
Organism:Homo sapiens (Human)
Description:n/a
Residue:400
BDBM50129426
NameBDBM50129426
Synonyms:CHEMBL69451 N-{4-[4-(2,3-Dichloro-phenyl)-piperazin-1-yl]-butyl}-4-pyridin-2-yl-benzamide
TypeSmall organic molecule
Emp. Form.C26H28Cl2N4O
Mol. Mass.483.433
SMILESClc1cccc(N2CCN(CCCCNC(=O)c3ccc(cc3)-c3ccccn3)CC2)c1Cl