Reaction Details
TargetD(3) dopamine receptor
LigandBDBM50119390
Substrate/Competitorn/a
Meas. Tech.ChEMBL_302737 (CHEMBL838684)
Ki 0.8±n/a nM
Citation Grundt, PCarlson, EECao, JBennett, CJMcElveen, ETaylor, MLuedtke, RRNewman, AH Novel heterocyclic trans olefin analogues of N-{4-[4-(2,3-dichlorophenyl)piperazin-1-yl]butyl}arylcarboxamides as selective probes with high affinity for the dopamine D3 receptor. J Med Chem48:839-48 (2005) 
 
D(3) dopamine receptor
Name:D(3) dopamine receptor
Type:n/a
Mol. Mass.:44243.43
Organism:Homo sapiens (Human)
Description:n/a
Residue:400
BDBM50119390
NameBDBM50119390
Synonyms:Benzo[b]thiophene-2-carboxylic acid {4-[4-(2,3-dichloro-phenyl)-piperazin-1-yl]-butyl}-amide N-(4-(4-(2,3-dichlorophenyl)piperazin-1-yl)butyl)benzo[b]thiophene-2-carboxamide
TypeSmall organic molecule
Emp. Form.C23H25Cl2N3OS
Mol. Mass.462.435
SMILESClc1cccc(N2CCN(CCCCNC(=O)c3cc4ccccc4s3)CC2)c1Cl