Reaction Details
TargetD(3) dopamine receptor
LigandBDBM50161242
Substrate/Competitorn/a
Meas. Tech.ChEMBL_302737 (CHEMBL838684)
Ki 1.1±n/a nM
Citation Grundt, PCarlson, EECao, JBennett, CJMcElveen, ETaylor, MLuedtke, RRNewman, AH Novel heterocyclic trans olefin analogues of N-{4-[4-(2,3-dichlorophenyl)piperazin-1-yl]butyl}arylcarboxamides as selective probes with high affinity for the dopamine D3 receptor. J Med Chem48:839-48 (2005) 
 
D(3) dopamine receptor
Name:D(3) dopamine receptor
Type:n/a
Mol. Mass.:44243.43
Organism:Homo sapiens (Human)
Description:n/a
Residue:400
BDBM50161242
NameBDBM50161242
Synonyms:Benzo[b]thiophene-2-carboxylic acid {4-[4-(2,3-dichloro-phenyl)-piperazin-1-yl]-but-2-enyl}-amide | CHEMBL175734
TypeSmall organic molecule
Emp. Form.C23H23Cl2N3OS
Mol. Mass.460.419
SMILESClc1cccc(N2CCN(C\C=C\CNC(=O)c3cc4ccccc4s3)CC2)c1Cl