Reaction Details
TargetD(3) dopamine receptor
LigandBDBM50161221
Substrate/Competitorn/a
Meas. Tech.ChEMBL_302737 (CHEMBL838684)
Ki 0.7±n/a nM
Citation Grundt, PCarlson, EECao, JBennett, CJMcElveen, ETaylor, MLuedtke, RRNewman, AH Novel heterocyclic trans olefin analogues of N-{4-[4-(2,3-dichlorophenyl)piperazin-1-yl]butyl}arylcarboxamides as selective probes with high affinity for the dopamine D3 receptor. J Med Chem48:839-48 (2005) 
 
D(3) dopamine receptor
Name:D(3) dopamine receptor
Type:n/a
Mol. Mass.:44243.43
Organism:Homo sapiens (Human)
Description:n/a
Residue:400
BDBM50161221
NameBDBM50161221
Synonyms:CHEMBL194493 N-{4-[4-(2,3-Dichloro-phenyl)-piperazin-1-yl]-but-2-enyl}-4-nitro-benzamide
TypeSmall organic molecule
Emp. Form.C21H22Cl2N4O3
Mol. Mass.449.33
SMILES[O-][N+](=O)c1ccc(cc1)C(=O)NC\C=C\CN1CCN(CC1)c1cccc(Cl)c1Cl