Reaction Details
TargetThymidylate synthase
LigandBDBM50161776
Substrate/Competitorn/a
Meas. Tech.ChEMBL_302802 (CHEMBL838510)
Ki 9.4±n/a nM
Citation Tondi, DVenturelli, AFerrari, SGhelli, SCosti, MP Improving specificity vs bacterial thymidylate synthases through N-dansyl modulation of didansyltyrosine. J Med Chem48:913-6 (2005) 
 
Thymidylate synthase
Name:Thymidylate synthase
Type:n/a
Mol. Mass.:30487.86
Organism:Escherichia coli
Description:n/a
Residue:264
BDBM50161776
NameBDBM50161776
Synonyms:(S)-2-(5-Benzyloxycarbonylamino-naphthalene-1-sulfonylamino)-3-[4-(5-dimethylamino-naphthalene-1-sulfonyloxy)-phenyl]-propionic acid | CHEMBL360758
TypeSmall organic molecule
Emp. Form.C39H35N3O9S2
Mol. Mass.753.84
SMILESCN(C)c1cccc2c(cccc12)S(=O)(=O)Oc1ccc(C[C@H](NS(=O)(=O)c2cccc3c(NC(=O)OCc4ccccc4)cccc23)C(O)=O)cc1