Reaction Details
TargetSerine/threonine-protein kinase B-raf
LigandBDBM50590426
Substrate/Competitorn/a
Meas. Tech.ChEMBL_2196738 (CHEMBL5109254)
IC50 0.310000±n/a nM
Citation Miller, DSJVoell, SASosi?, IProj, MRossanese, OWSchnakenburg, GGütschow, MCollins, ISteinebach, C Encoding BRAF inhibitor functions in protein degraders. RSC Med Chem13:731-736 (2022) 
 
Serine/threonine-protein kinase B-raf
Name:Serine/threonine-protein kinase B-raf
Type:Serine/threonine-protein kinase
Mol. Mass.:84446.00
Organism:Homo sapiens (Human)
Description:P15056
Residue:766
BDBM50590426
NameBDBM50590426
Synonyms:CHEMBL5196107
TypeSmall organic molecule
Emp. Form.C57H68F2N8O11S2
Mol. Mass.1143.324
SMILESCCCS(=O)(=O)Nc1ccc(F)c(C(=O)c2c[nH]c3ncc(cc23)-c2ccc(cc2)C(=O)NCCOCCOCCOCCCCC(=O)N[C@H](C(=O)N2C[C@H](O)C[C@H]2C(=O)NCc2ccc(cc2)-c2scnc2C)C(C)(C)C)c1F