Reaction Details
TargetGABA-A receptor; alpha-2/beta-3/gamma-2
LigandBDBM50162207
Substrate/Competitorn/a
Meas. Tech.ChEMBL_303657 (CHEMBL829005)
Ki 3.4±n/a nM
Citation Russell, MGCarling, RWAtack, JRBromidge, FACook, SMHunt, PIsted, CLucas, MMcKernan, RMMitchinson, AMoore, KWNarquizian, RMacaulay, AJThomas, DThompson, SAWafford, KACastro, JL Discovery of functionally selective 7,8,9,10-tetrahydro-7,10-ethano-1,2,4-triazolo[3,4-a]phthalazines as GABA A receptor agonists at the alpha3 subunit. J Med Chem48:1367-83 (2005) 
 
GABA-A receptor; alpha-2/beta-3/gamma-2
Name:GABA-A receptor; alpha-2/beta-3/gamma-2
Type:n/a
Mol. Mass.:n/a
Description:ASSAY_ID of ChEMBL is 2148174
Components:This complex has 3 components.
Component 1
Name:Gamma-aminobutyric acid receptor subunit gamma-2
Synonyms:GABA(A) receptor subunit gamma-2 GBRG2_HUMAN
Type:PROTEIN
Mol. Mass.:54172.74
Organism:Homo sapiens (Human)
Description:EBI_217
Residue:467
Component 2
Name:Gamma-aminobutyric acid receptor subunit beta-3
Synonyms:GABA A receptor alpha-4/beta-3/gamma-2 GABA-A receptor GBRB3_HUMAN | agonist GABA site
Type:PROTEIN
Mol. Mass.:54130.51
Organism:Homo sapiens (Human)
Description:ChEMBL_448071
Residue:473
Component 3
Name:Gamma-aminobutyric acid receptor subunit alpha-2
Synonyms:GABA receptor alpha-2 subunit GBRA2_HUMAN | Gamma-aminobutyric acid receptor subunit alpha-2 (GABRA2)
Type:Protein
Mol. Mass.:51338.78
Organism:Homo sapiens (Human)
Description:P47869
Residue:451
BDBM50162207
NameBDBM50162207
Synonyms:3,5-dimethyl-2-pyridyl 6-phenyl-4,5,7,8-tetraazatetracyclo[9.2.2.02,10.03,7]pentadeca-2(10),3,5,8-tetraen-9-yl ether | CHEMBL178677
TypeSmall organic molecule
Emp. Form.C25H25N5O
Mol. Mass.411.4989
SMILESCc1cnc(COc2nn3c(nnc3c3C4CCC(CC4)c23)-c2ccccc2)c(C)c1