Reaction Details
TargetDihydrofolate reductase
LigandBDBM50049601
Substrate/Competitorn/a
Meas. Tech.ChEMBL_305461 (CHEMBL830957)
IC50 18±n/a nM
Citation Gangjee, ALin, X CoMFA and CoMSIA analyses of Pneumocystis carinii dihydrofolate reductase, Toxoplasma gondii dihydrofolate reductase, and rat liver dihydrofolate reductase. J Med Chem48:1448-69 (2005) 
 
Dihydrofolate reductase
Name:Dihydrofolate reductase
Type:Enzyme
Mol. Mass.:21638.84
Organism:Rattus norvegicus (rat)
Description:n/a
Residue:187
BDBM50049601
NameBDBM50049601
Synonyms:6-{[(4-Methoxy-phenyl)-methyl-amino]-methyl}-pyrido[3,2-d]pyrimidine-2,4-diamine | CHEMBL415962
TypeSmall organic molecule
Emp. Form.C16H18N6O
Mol. Mass.310.3537
SMILESCOc1ccc(cc1)N(C)Cc1ccc2nc(N)nc(N)c2n1