Reaction Details
TargetBifunctional dihydrofolate reductase-thymidylate synthase
LigandBDBM50049601
Substrate/Competitorn/a
Meas. Tech.ChEMBL_305629 (CHEMBL828662)
IC50 16±n/a nM
Citation Gangjee, ALin, X CoMFA and CoMSIA analyses of Pneumocystis carinii dihydrofolate reductase, Toxoplasma gondii dihydrofolate reductase, and rat liver dihydrofolate reductase. J Med Chem48:1448-69 (2005) 
 
Bifunctional dihydrofolate reductase-thymidylate synthase
Name:Bifunctional dihydrofolate reductase-thymidylate synthase
Type:Enzyme
Mol. Mass.:68757.49
Organism:Toxoplasma gondii
Description:Q07422
Residue:610
BDBM50049601
NameBDBM50049601
Synonyms:6-{[(4-Methoxy-phenyl)-methyl-amino]-methyl}-pyrido[3,2-d]pyrimidine-2,4-diamine | CHEMBL415962
TypeSmall organic molecule
Emp. Form.C16H18N6O
Mol. Mass.310.3537
SMILESCOc1ccc(cc1)N(C)Cc1ccc2nc(N)nc(N)c2n1