Reaction Details
TargetSerpin H1
LigandBDBM50162505
Substrate/Competitorn/a
Meas. Tech.ChEMBL_305934 (CHEMBL833481)
IC50 3100±n/a nM
Citation Thomson, CAAtkinson, HMAnanthanarayanan, VS Identification of small molecule chemical inhibitors of the collagen-specific chaperone Hsp47. J Med Chem48:1680-4 (2005) 
 
Serpin H1
Name:Serpin H1
Type:PROTEIN
Mol. Mass.:46451.09
Organism:Homo sapiens (Human)
Description:ChEMBL_305934
Residue:418
BDBM50162505
NameBDBM50162505
Synonyms:6-Chloro-2-oxo-2,3-dihydro-2lambda*4*-benzo[1,2,3]dithiazole-4-carboxylic acid methyl ester | CHEMBL371508
TypeSmall organic molecule
Emp. Form.C8H6ClNO3S2
Mol. Mass.263.721
SMILESCOC(=O)c1cc(Cl)cc2SS(=O)Nc12