Reaction Details
TargetSerpin H1
LigandBDBM50162507
Substrate/Competitorn/a
Meas. Tech.ChEMBL_305934 (CHEMBL833481)
IC50 26600±n/a nM
Citation Thomson, CAAtkinson, HMAnanthanarayanan, VS Identification of small molecule chemical inhibitors of the collagen-specific chaperone Hsp47. J Med Chem48:1680-4 (2005) 
 
Serpin H1
Name:Serpin H1
Type:PROTEIN
Mol. Mass.:46451.09
Organism:Homo sapiens (Human)
Description:ChEMBL_305934
Residue:418
BDBM50162507
NameBDBM50162507
Synonyms:4-[1-(4-Methoxy-phenyl)-2-nitro-ethylsulfanyl]-phenylamine | CHEMBL195333
TypeSmall organic molecule
Emp. Form.C15H16N2O3S
Mol. Mass.304.364
SMILESCOc1ccc(cc1)C(C[N+]([O-])=O)Sc1ccc(N)cc1