Reaction Details
TargetMetabotropic glutamate receptor 2
LigandBDBM50162570
Substrate/Competitorn/a
Meas. Tech.ChEMBL_304142 (CHEMBL840258)
EC50 600±n/a nM
Citation Pinkerton, ABCube, RVHutchinson, JHJames, JKGardner, MFRowe, BASchaffhauser, HRodriguez, DECampbell, UCDaggett, LPVernier, JM Allosteric potentiators of the metabotropic glutamate receptor 2 (mGlu2). Part 3: Identification and biological activity of indanone containing mGlu2 receptor potentiators. Bioorg Med Chem Lett15:1565-71 (2005) 
 
Metabotropic glutamate receptor 2
Name:Metabotropic glutamate receptor 2
Type:Enzyme
Mol. Mass.:95584.88
Organism:Homo sapiens (Human)
Description:Q14416
Residue:872
BDBM50162570
NameBDBM50162570
Synonyms:2-(6,7-Dichloro-2-cyclopentyl-2-methyl-1-oxo-indan-5-yloxy)-N-[4-(2H-tetrazol-5-yl)-phenyl]-acetamide | CHEMBL361358
TypeSmall organic molecule
Emp. Form.C24H23Cl2N5O3
Mol. Mass.500.377
SMILESCC1(Cc2cc(OCC(=O)Nc3ccc(cc3)-c3nnn[nH]3)c(Cl)c(Cl)c2C1=O)C1CCCC1