Reaction Details
TargetMetabotropic glutamate receptor 2
LigandBDBM50162577
Substrate/Competitorn/a
Meas. Tech.ChEMBL_304142 (CHEMBL840258)
EC50 276±n/a nM
Citation Pinkerton, ABCube, RVHutchinson, JHJames, JKGardner, MFRowe, BASchaffhauser, HRodriguez, DECampbell, UCDaggett, LPVernier, JM Allosteric potentiators of the metabotropic glutamate receptor 2 (mGlu2). Part 3: Identification and biological activity of indanone containing mGlu2 receptor potentiators. Bioorg Med Chem Lett15:1565-71 (2005) 
 
Metabotropic glutamate receptor 2
Name:Metabotropic glutamate receptor 2
Type:Enzyme
Mol. Mass.:95584.88
Organism:Homo sapiens (Human)
Description:Q14416
Residue:872
BDBM50162577
NameBDBM50162577
Synonyms:6,7-Dichloro-2-cyclopentyl-2-methyl-5-{2-[4-(2H-tetrazol-5-yl)-phenoxy]-ethoxy}-indan-1-one | CHEMBL367823
TypeSmall organic molecule
Emp. Form.C24H24Cl2N4O3
Mol. Mass.487.378
SMILESCC1(Cc2cc(OCCOc3ccc(cc3)-c3nnn[nH]3)c(Cl)c(Cl)c2C1=O)C1CCCC1