Reaction Details
Target5-hydroxytryptamine receptor 2A
LigandBDBM50162954
Substrate/Competitorn/a
Meas. Tech.ChEMBL_302976 (CHEMBL827955)
Ki 1.35±n/a nM
Citation Campiani, GButini, SFattorusso, CTrotta, FGemma, SCatalanotti, BNacci, VFiorini, ICagnotto, AMereghetti, IMennini, TMinetti, PDi Cesare, MAStasi, MADi Serio, SGhirardi, OTinti, OCarminati, P Novel atypical antipsychotic agents: rational design, an efficient palladium-catalyzed route, and pharmacological studies. J Med Chem48:1705-8 (2005) 
 
5-hydroxytryptamine receptor 2A
Name:5-hydroxytryptamine receptor 2A
Type:G Protein-Coupled Receptor (GPCR)
Mol. Mass.:52852.05
Organism:Rattus norvegicus (rat)
Description:Rat cortex membranes 5-HT2A receptors.
Residue:471
BDBM50162954
NameBDBM50162954
Synonyms:8-Chloro-11-(4-methyl-piperazin-1-yl)-5H-benzo[e]pyrrolo[1,2-a]azepine | CHEMBL179557
TypeSmall organic molecule
Emp. Form.C18H20ClN3
Mol. Mass.313.825
SMILESCN1CCN(CC1)C1=Cc2cc(Cl)ccc2Cn2cccc12