Reaction Details
Target5-hydroxytryptamine receptor 2A
LigandBDBM50162953
Substrate/Competitorn/a
Meas. Tech.ChEMBL_302976 (CHEMBL827955)
Ki 2.15±n/a nM
Citation Campiani, GButini, SFattorusso, CTrotta, FGemma, SCatalanotti, BNacci, VFiorini, ICagnotto, AMereghetti, IMennini, TMinetti, PDi Cesare, MAStasi, MADi Serio, SGhirardi, OTinti, OCarminati, P Novel atypical antipsychotic agents: rational design, an efficient palladium-catalyzed route, and pharmacological studies. J Med Chem48:1705-8 (2005) 
 
5-hydroxytryptamine receptor 2A
Name:5-hydroxytryptamine receptor 2A
Type:G Protein-Coupled Receptor (GPCR)
Mol. Mass.:52852.05
Organism:Rattus norvegicus (rat)
Description:Rat cortex membranes 5-HT2A receptors.
Residue:471
BDBM50162953
NameBDBM50162953
Synonyms:9-(4-Methyl-piperazin-1-yl)-3,4-dithia-7a-aza-cyclopenta[f]azulene | CHEMBL180319
TypeSmall organic molecule
Emp. Form.C15H17N3S2
Mol. Mass.303.446
SMILESCN1CCN(CC1)C1=Cn2cccc2Sc2sccc12