Reaction Details
Target5-hydroxytryptamine receptor 2C
LigandBDBM50162957
Substrate/Competitorn/a
Meas. Tech.ChEMBL_303163 (CHEMBL829975)
Ki 0.21±n/a nM
Citation Fernández, JAlonso, JMAndrés, JICid, JMDíaz, AIturrino, LGil, PMegens, ASipido, VKTrabanco, AA Discovery of new tetracyclic tetrahydrofuran derivatives as potential broad-spectrum psychotropic agents. J Med Chem48:1709-12 (2005) 
 
5-hydroxytryptamine receptor 2C
Name:5-hydroxytryptamine receptor 2C
Type:G Protein-Coupled Receptor (GPCR)
Mol. Mass.:51836.79
Organism:Homo sapiens (Human)
Description:P28335
Residue:458
BDBM50162957
NameBDBM50162957
Synonyms:(11-Fluoro-2,3,3a,12b-tetrahydro-1-oxa-8-thia-dibenzo[e,h]azulen-2-ylmethyl)-dimethyl-amine | CHEMBL193639
TypeSmall organic molecule
Emp. Form.C19H20FNOS
Mol. Mass.329.432
SMILESCN(C)C[C@H]1CC2[C@H](O1)c1cc(F)ccc1Sc1ccccc21