Reaction Details
TargetTransporter
LigandBDBM50162957
Substrate/Competitorn/a
Meas. Tech.ChEMBL_303056 (CHEMBL828882)
Ki 1.60±n/a nM
Citation Fernández, JAlonso, JMAndrés, JICid, JMDíaz, AIturrino, LGil, PMegens, ASipido, VKTrabanco, AA Discovery of new tetracyclic tetrahydrofuran derivatives as potential broad-spectrum psychotropic agents. J Med Chem48:1709-12 (2005) 
 
Transporter
Name:Transporter
Type:PROTEIN
Mol. Mass.:66787.87
Organism:Rattus norvegicus
Description:ChEMBL_1463061
Residue:597
BDBM50162957
NameBDBM50162957
Synonyms:(11-Fluoro-2,3,3a,12b-tetrahydro-1-oxa-8-thia-dibenzo[e,h]azulen-2-ylmethyl)-dimethyl-amine | CHEMBL193639
TypeSmall organic molecule
Emp. Form.C19H20FNOS
Mol. Mass.329.432
SMILESCN(C)C[C@H]1CC2[C@H](O1)c1cc(F)ccc1Sc1ccccc21