Reaction Details
Target5-hydroxytryptamine receptor 2C
LigandBDBM50162961
Substrate/Competitorn/a
Meas. Tech.ChEMBL_303163 (CHEMBL829975)
Ki 2.4±n/a nM
Citation Fernández, JAlonso, JMAndrés, JICid, JMDíaz, AIturrino, LGil, PMegens, ASipido, VKTrabanco, AA Discovery of new tetracyclic tetrahydrofuran derivatives as potential broad-spectrum psychotropic agents. J Med Chem48:1709-12 (2005) 
 
5-hydroxytryptamine receptor 2C
Name:5-hydroxytryptamine receptor 2C
Type:G Protein-Coupled Receptor (GPCR)
Mol. Mass.:51836.79
Organism:Homo sapiens (Human)
Description:P28335
Residue:458
BDBM50162961
NameBDBM50162961
Synonyms:(11-Chloro-2,3,3a,12b-tetrahydro-1,8-dioxa-dibenzo[e,h]azulen-2-ylmethyl)-dimethyl-amine | CHEMBL435301
TypeSmall organic molecule
Emp. Form.C19H20ClNO2
Mol. Mass.329.821
SMILESCN(C)C[C@H]1CC2[C@H](O1)c1cc(Cl)ccc1Oc1ccccc21