Reaction Details
TargetNeuronal acetylcholine receptor subunit alpha-3/beta-2
LigandBDBM50162989
Substrate/Competitorn/a
Meas. Tech.ChEMBL_303420 (CHEMBL840083)
Ki 48±n/a nM
Citation Wei, ZLXiao, YYuan, HBaydyuk, MPetukhov, PAMusachio, JLKellar, KJKozikowski, AP Novel pyridyl ring C5 substituted analogues of epibatidine and 3-(1-methyl-2(S)-pyrrolidinylmethoxy)pyridine (A-84543) as highly selective agents for neuronal nicotinic acetylcholine receptors containing beta2 subunits. J Med Chem48:1721-4 (2005) 
 
Neuronal acetylcholine receptor subunit alpha-3/beta-2
Name:Neuronal acetylcholine receptor subunit alpha-3/beta-2
Type:n/a
Mol. Mass.:n/a
Description:ASSAY_ID of EBI is 143246
Components:This complex has 2 components.
Component 1
Name:Neuronal acetylcholine receptor subunit beta-2
Synonyms:ACHB2_HUMAN Neuronal acetylcholine receptor protein beta-2 subunit | Nicotinic acetylcholine receptor alpha3/beta2/alpha5
Type:Protein
Mol. Mass.:57020.50
Organism:Homo sapiens (Human)
Description:P17787
Residue:502
Component 2
Name:Neuronal acetylcholine receptor subunit alpha-3
Synonyms:ACHA3_HUMAN Cholinergic, Nicotinic Alpha3Beta2 Cholinergic, Nicotinic Alpha3Beta4x NACHRA3 Neuronal acetylcholine receptor subunit alpha-3 nicotinic central
Type:Enzyme Catalytic Domain
Mol. Mass.:57479.03
Organism:Homo sapiens (Human)
Description:Cholinergic, Nicotinic Alpha3Beta2 0 HUMAN::P32297
Residue:505
BDBM50162989
NameBDBM50162989
Synonyms:10-[5-((S)-1-Methyl-pyrrolidin-2-ylmethoxy)-pyridin-3-yl]-dec-9-yn-1-ol | CHEMBL175639
TypeSmall organic molecule
Emp. Form.C21H32N2O2
Mol. Mass.344.491
SMILESCN1CCC[C@H]1COc1cncc(c1)C#CCCCCCCCCO