Reaction Details
TargetNeuronal acetylcholine receptor subunit alpha-4/beta-2
LigandBDBM50162982
Substrate/Competitorn/a
Meas. Tech.ChEMBL_303478 (CHEMBL838852)
Ki 1.4±n/a nM
Citation Wei, ZLXiao, YYuan, HBaydyuk, MPetukhov, PAMusachio, JLKellar, KJKozikowski, AP Novel pyridyl ring C5 substituted analogues of epibatidine and 3-(1-methyl-2(S)-pyrrolidinylmethoxy)pyridine (A-84543) as highly selective agents for neuronal nicotinic acetylcholine receptors containing beta2 subunits. J Med Chem48:1721-4 (2005) 
 
Neuronal acetylcholine receptor subunit alpha-4/beta-2
Name:Neuronal acetylcholine receptor subunit alpha-4/beta-2
Type:n/a
Mol. Mass.:n/a
Description:n/a
Components:This complex has 0 components.
Component 1
Name:Neuronal acetylcholine receptor subunit alpha-4
Synonyms:ACHA4_RAT Cholinergic, Nicotinic Alpha4Beta2 Chrna4 Neuronal acetylcholine receptor (alpha4beta2 nAChR) Neuronal acetylcholine receptor subunit alpha 4 beta 2 | Neuronal acetylcholine receptor subunit alpha-4
Type:Enzyme
Mol. Mass.:70196.44
Organism:Rattus norvegicus (Rat)
Description:P09483
Residue:630
Component 2
Name:Neuronal acetylcholine receptor subunit beta-2
Synonyms:ACHB2_RAT Chrnb2 Neuronal acetylcholine receptor non-alpha-1 chain
Type:Enzyme
Mol. Mass.:56910.32
Organism:Rattus norvegicus (Rat)
Description:P12390
Residue:500
BDBM50162982
NameBDBM50162982
Synonyms:3-Hex-1-ynyl-5-((S)-1-methyl-pyrrolidin-2-ylmethoxy)-pyridine | CHEMBL174543
TypeSmall organic molecule
Emp. Form.C17H24N2O
Mol. Mass.272.3853
SMILESCCCCC#Cc1cncc(OC[C@@H]2CCCN2C)c1