Reaction Details
TargetAdenosine receptor A3
LigandBDBM50163025
Substrate/Competitorn/a
Meas. Tech.ChEMBL_303147 (CHEMBL829121)
Ki 0.76±n/a nM
Citation Tchilibon, SJoshi, BVKim, SKDuong, HTGao, ZGJacobson, KA (N)-methanocarba 2,N6-disubstituted adenine nucleosides as highly potent and selective A3 adenosine receptor agonists. J Med Chem48:1745-58 (2005) 
 
Adenosine receptor A3
Name:Adenosine receptor A3
Type:PROTEIN
Mol. Mass.:36643.73
Organism:Rattus norvegicus
Description:ChEMBL_479910
Residue:320
BDBM50163025
NameBDBM50163025
Synonyms:(1S,2R,3S,4R,5S)-4-(6-(3-bromobenzylamino)-2-chloro-9H-purin-9-yl)-2,3-dihydroxy-N-methylbicyclo[3.1.0]hexane-1-carboxamide CHEMBL425741
TypeSmall organic molecule
Emp. Form.C20H20BrClN6O3
Mol. Mass.507.768
SMILESCNC(=O)[C@]12C[C@@H]1[C@H]([C@H](O)[C@@H]2O)n1cnc2c(NCc3cccc(Br)c3)nc(Cl)nc12