Reaction Details
TargetPhenylethanolamine N-methyltransferase
LigandBDBM50163109
Substrate/Competitorn/a
Meas. Tech.ChEMBL_303574 (CHEMBL828974)
Ki 72.0±n/a nM
Citation Grunewald, GLRomero, FACriscione, KR Nanomolar inhibitors of CNS epinephrine biosynthesis: (R)-(+)-3-fluoromethyl-7-(N-substituted aminosulfonyl)-1,2,3,4-tetrahydroisoquinolines as potent and highly selective inhibitors of phenylethanolamine N-methyltransferase1. J Med Chem48:1806-12 (2005) 
 
Phenylethanolamine N-methyltransferase
Name:Phenylethanolamine N-methyltransferase
Type:Enzyme
Mol. Mass.:30852.66
Organism:Homo sapiens (Human)
Description:n/a
Residue:282
BDBM50163109
NameBDBM50163109
Synonyms:(R)-3-Fluoromethyl-1,2,3,4-tetrahydro-isoquinoline-7-sulfonic acid amide | CHEMBL361203
TypeSmall organic molecule
Emp. Form.C10H13FN2O2S
Mol. Mass.244.286
SMILESNS(=O)(=O)c1ccc2C[C@H](CF)NCc2c1