Reaction Details
TargetMyosin light chain kinase, smooth muscle
LigandBDBM50590939
Substrate/Competitorn/a
Meas. Tech.ChEMBL_2198945 (CHEMBL5111461)
IC50 265±n/a nM
Citation Drewry, DHPotjewyd, FMBayati, ASmith, JLDickmander, RJHowell, STaft-Benz, SMin, SMHossain, MAHeise, MMcPherson, PSMoorman, NJAxtman, AD Identification and Utilization of a Chemical Probe to Interrogate the Roles of PIKfyve in the Lifecycle of ?-Coronaviruses. J Med Chem65:12860-12882 (2022) 
 
Myosin light chain kinase, smooth muscle
Name:Myosin light chain kinase, smooth muscle
Type:Protein
Mol. Mass.:210702.56
Organism:Homo sapiens (Human)
Description:Q15746
Residue:1914
BDBM50590939
NameBDBM50590939
Synonyms:CHEMBL5174830
TypeSmall organic molecule
Emp. Form.C20H21N5
Mol. Mass.331.4142
SMILESCN(C)CC#Cc1ccc2[nH]c3CCCc4cnc(N)nc4-c3c2c1