Reaction Details
TargetAlpha-2A adrenergic receptor
LigandBDBM50024310
Substrate/Competitorn/a
Meas. Tech.ChEMBL_302772 (CHEMBL838835)
Ki 1.8±n/a nM
Citation Andrés, JIAlcázar, JAlonso, JMAlvarez, RMBakker, MHBiesmans, ICid, JMDe Lucas, AIFernández, JFont, LMHens, KAIturrino, LLenaerts, IMartínez, SMegens, AAPastor, JVermote, PCSteckler, T Discovery of a new series of centrally active tricyclic isoxazoles combining serotonin (5-HT) reuptake inhibition with alpha2-adrenoceptor blocking activity. J Med Chem48:2054-71 (2005) 
 
Alpha-2A adrenergic receptor
Name:Alpha-2A adrenergic receptor
Type:Enzyme
Mol. Mass.:48979.91
Organism:Homo sapiens (Human)
Description:P08913
Residue:465
BDBM50024310
NameBDBM50024310
Synonyms:CHEMBL2112972
TypeSmall organic molecule
Emp. Form.C28H29N3O2
Mol. Mass.439.5488
SMILES[H][C@@]12C=Cc3cc(OC)ccc3C1=NO[C@H]2CN1CCN(Cc2ccc3ccccc3c2)CC1