Reaction Details
TargetAlpha-2C adrenergic receptor
LigandBDBM50024316
Substrate/Competitorn/a
Meas. Tech.ChEMBL_302773 (CHEMBL852482)
Ki 1.7±n/a nM
Citation Andrés, JIAlcázar, JAlonso, JMAlvarez, RMBakker, MHBiesmans, ICid, JMDe Lucas, AIFernández, JFont, LMHens, KAIturrino, LLenaerts, IMartínez, SMegens, AAPastor, JVermote, PCSteckler, T Discovery of a new series of centrally active tricyclic isoxazoles combining serotonin (5-HT) reuptake inhibition with alpha2-adrenoceptor blocking activity. J Med Chem48:2054-71 (2005) 
 
Alpha-2C adrenergic receptor
Name:Alpha-2C adrenergic receptor
Type:Enzyme
Mol. Mass.:49552.32
Organism:Homo sapiens (Human)
Description:P18825
Residue:462
BDBM50024316
NameBDBM50024316
Synonyms:CHEMBL2112978
TypeSmall organic molecule
Emp. Form.C24H27N3O2
Mol. Mass.389.4901
SMILES[H][C@@]12COc3ccccc3C1=NO[C@H]2CN1CCN(C\C=C\c2ccccc2)CC1