Reaction Details
TargetAlpha-2C adrenergic receptor
LigandBDBM50163491
Substrate/Competitorn/a
Meas. Tech.ChEMBL_302773 (CHEMBL852482)
Ki 0.200000±n/a nM
Citation Andrés, JIAlcázar, JAlonso, JMAlvarez, RMBakker, MHBiesmans, ICid, JMDe Lucas, AIFernández, JFont, LMHens, KAIturrino, LLenaerts, IMartínez, SMegens, AAPastor, JVermote, PCSteckler, T Discovery of a new series of centrally active tricyclic isoxazoles combining serotonin (5-HT) reuptake inhibition with alpha2-adrenoceptor blocking activity. J Med Chem48:2054-71 (2005) 
 
Alpha-2C adrenergic receptor
Name:Alpha-2C adrenergic receptor
Type:Enzyme
Mol. Mass.:49552.32
Organism:Homo sapiens (Human)
Description:P18825
Residue:462
BDBM50163491
NameBDBM50163491
Synonyms:CHEMBL175853 | Methoxy-acetic acid (3R,3aS)-3-[4-((E)-2-methyl-3-phenyl-allyl)-piperazin-1-ylmethyl]-3a,4-dihydro-3H-chromeno[4,3-c]isoxazol-7-yl ester
TypeSmall organic molecule
Emp. Form.C28H33N3O5
Mol. Mass.491.5787
SMILESCOCC(=O)Oc1ccc2C3=NO[C@@H](CN4CCN(C\C(C)=C\c5ccccc5)CC4)[C@@H]3COc2c1