Reaction Details
TargetAlpha-2C adrenergic receptor
LigandBDBM50131346
Substrate/Competitorn/a
Meas. Tech.ChEMBL_303466 (CHEMBL838762)
Ki 0.100000±n/a nM
Citation Andrés, JIAlcázar, JAlonso, JMAlvarez, RMBakker, MHBiesmans, ICid, JMDe Lucas, AIFernández, JFont, LMHens, KAIturrino, LLenaerts, IMartínez, SMegens, AAPastor, JVermote, PCSteckler, T Discovery of a new series of centrally active tricyclic isoxazoles combining serotonin (5-HT) reuptake inhibition with alpha2-adrenoceptor blocking activity. J Med Chem48:2054-71 (2005) 
 
Alpha-2C adrenergic receptor
Name:Alpha-2C adrenergic receptor
Type:Enzyme
Mol. Mass.:49552.32
Organism:Homo sapiens (Human)
Description:P18825
Residue:462
BDBM50131346
NameBDBM50131346
Synonyms:(3R,3aS)-7,8-Dimethoxy-3-[4-((E)-2-methyl-3-phenyl-allyl)-piperazin-1-ylmethyl]-3a,4-dihydro-3H-chromeno[4,3-c]isoxazole CHEMBL91157
TypeSmall organic molecule
Emp. Form.C27H33N3O4
Mol. Mass.463.5686
SMILESCOc1cc2OC[C@H]3[C@H](CN4CCN(C\C(C)=C\c5ccccc5)CC4)ON=C3c2cc1OC