Reaction Details
TargetAlpha-2A adrenergic receptor
LigandBDBM50163489
Substrate/Competitorn/a
Meas. Tech.ChEMBL_302772 (CHEMBL838835)
Ki 0.400000±n/a nM
Citation Andrés, JIAlcázar, JAlonso, JMAlvarez, RMBakker, MHBiesmans, ICid, JMDe Lucas, AIFernández, JFont, LMHens, KAIturrino, LLenaerts, IMartínez, SMegens, AAPastor, JVermote, PCSteckler, T Discovery of a new series of centrally active tricyclic isoxazoles combining serotonin (5-HT) reuptake inhibition with alpha2-adrenoceptor blocking activity. J Med Chem48:2054-71 (2005) 
 
Alpha-2A adrenergic receptor
Name:Alpha-2A adrenergic receptor
Type:Enzyme
Mol. Mass.:48979.91
Organism:Homo sapiens (Human)
Description:P08913
Residue:465
BDBM50163489
NameBDBM50163489
Synonyms:Acetic acid (3R,3aS)-3-[4-((E)-2-methyl-3-phenyl-allyl)-piperazin-1-ylmethyl]-3a,4-dihydro-3H-chromeno[4,3-c]isoxazol-7-ylester | CHEMBL176116
TypeSmall organic molecule
Emp. Form.C27H31N3O4
Mol. Mass.461.5527
SMILESCC(=O)Oc1ccc2C3=NO[C@@H](CN4CCN(C\C(C)=C\c5ccccc5)CC4)[C@@H]3COc2c1