Reaction Details
TargetAdenosine receptor A3
LigandBDBM50053929
Substrate/Competitorn/a
Meas. Tech.ChEMBL_2199478 (CHEMBL5111994)
IC50 0.097724±n/a nM
Citation Stampelou, MSuchankova, ATzortzini, EDhingra, LBarkan, KLougiakis, NMarakos, PPouli, NLadds, GKolocouris, A Dual A1/A3 Adenosine Receptor Antagonists: Binding Kinetics and Structure-Activity Relationship Studies Using Mutagenesis and Alchemical Binding Free Energy Calculations. J Med Chem65:13305-13327 (2022) 
 
Adenosine receptor A3
Name:Adenosine receptor A3
Type:G Protein-Coupled Receptor (GPCR)
Mol. Mass.:36197.32
Organism:Homo sapiens (Human)
Description:P0DMS8
Residue:318
BDBM50053929
NameBDBM50053929
Synonyms:CHEMBL88147 N-(9-Chloro-2-furan-2-yl-[1,2,4]triazolo[1,5-c]quinazolin-5-yl)-N-methyl-2-phenyl-acetamide | N-(9-chloro-2-(furan-2-yl)-[1,2,4]triazolo[1,5-c]quinazolin-5-yl)-2-phenylacetamide
TypeSmall organic molecule
Emp. Form.C21H14ClN5O2
Mol. Mass.403.821
SMILESClc1ccc2nc(NC(=O)Cc3ccccc3)n3nc(nc3c2c1)-c1ccco1